{"text_format":"1","workbook":"xlsx","n_sheets":19,"sheets":["Cover","Overview","Instructions","Inputs-Current test volumes","Inputs-Reductions in testing","Inputs-Direct costs","Inputs-Analyzer Time","Inputs-Abnormal tests","Results","Appendices and References","Bkg-Ref scenario","Bkg-ND scenario","Bkg-Impact Results","Dropdowns","Central NS test numbers","EORLA Cost data","Test time","Data Store","Query Indirect costs"],"not_rendered":{"charts":0,"images":2,"macros":1,"external_links":0,"defined_names":22,"comments":0,"pivot_tables":0},"unopened":[],"bounds":{"document_bytes":16777216,"sheet_cells":100000,"rows_first":2000,"rows_last":500,"rows_between":2000,"halvings":0,"cell_chars":16384,"cell_head_chars":4096},"cells_cut":0,"cells_raw":0,"read":"whole","date_system":"1900"}

{"sheet":"Cover","index":0,"n_rows":41,"n_cols":7,"rows_kept":41,"cut":false,"hidden":false,"merged":[[40,3,41,23],[7,3,10,23],[18,3,19,23],[21,3,22,23],[24,3,26,23],[13,3,13,23],[15,3,15,23],[14,3,14,23],[11,3,12,23]]}
[]
[]
[]
[]
[]
[]
[]
[null,null,null,"Resource Savings Calculator: Reduction of Low-Value Laboratory Tests"]
[]
[]
[]
[null,null,null,"This economic tool was developed by CADTH to assist decision-makers considering the impact of reducing the use of five low value lab tests identified by Choosing Wisely Canada. The objective is to estimate the potential savings associated if the utilization of these five tests are reduced. Although outside the scope of this tool, by quantifying the potential resource savings, this may provide laboratories with insights on the magnitude of savings expected that could potentially be reinvested towards higher-value laboratory tests to further improve the quality of patient care. "]
[]
[null,null,null,"The tool is provided for estimation purposes only and does not constitute any policy advice."]
[null,null,null,"This tool provides a standardized workbook that estimates the cost and analyzer time impact associated with reductions in lab test ordering. A four step process is introduced in which users must populate some input parameters, as relevant to their institutions. A fifth step (optional) exists for users who are interested in exploring the resource impact of reordering lab tests when abnormal findings are found in the original low-value laboratory tests. For inputs populated by CADTH, additional validation of these parameters within the \"Inputs-\" worksheets is required to ensure the impact calculator produces results that accurately reflect the user's institutional setting."]
{"$rows_left_out":27}
{"sheet":"Overview","index":1,"n_rows":39,"n_cols":4,"rows_kept":39,"cut":false,"hidden":false,"merged":[[54,2,54,10],[46,2,46,10],[44,2,44,10],[48,2,48,10],[49,2,49,10],[51,2,51,10],[11,3,11,19],[15,3,15,20],[16,3,16,20],[17,3,17,20],[52,2,52,10],[21,3,21,20],[22,3,22,20],[26,3,26,20],[24,3,24,20],[23,3,23,20],[25,3,25,20]]}
[]
[]
[]
[]
[]
[null,null,"Calculator Overview"]
[]
[null,null,"This sheet provides an overivew of the tool, key assumptions and abbreviations."]
[]
[null,null,"Overview"]
[]
[null,null,"Objective","To estimate the potential resource impact of reducing the use of 5 low-value lab tests:   \n\n- AST, including decoupling of routinely coupled AST/ALT\n- Urea, including decoupling of Urea/Creatinine \n- CK-MB, when troponin is available\n- PTT, including decoupling of routinely coupled PT/INR/PTT\n- Serum Folate "]
[null,null,"Perspective","Canadian public hospital lab setting"]
[null,null,"Time Horizon","2 years"]
[null,null,"Discounting & Inflation","Over the two year time horizon, it was assumed that costs would neither be discounted or inflated"]
{"$rows_left_out":25}
{"sheet":"Instructions","index":2,"n_rows":57,"n_cols":9,"rows_kept":57,"cut":false,"hidden":false,"merged":[[9,2,10,15]]}
[]
[]
[]
[]
[]
[null,null,"Instructions"]
[]
[null,null,"This sheet provides an overview of the steps required to derive a resource  impact estimate. "]
[null,null,"For steps that say define (Step 1), users MUST populate values. Although default values have been provided, these are unlikely to be appropriate for your jurisdiction."]
[null,null,"For steps that say validate (Steps 2 to 4), default values have been provided. Users should validate that the values reflect their jurisdictional context. If the default values are not appropriate for your jurisdiction, users can define alternatives."]
[]
[]
[null,null,"Step 1.  Define current test volumes in your institution"]
[null,null,"In step 1, users must define the current volume of lab tests being conducted in their institution in a world where there are no reductions or changes to lab test ordering. "]
[null,null,"Defaults have been provided, however, these are unlikely to reflect your jurisdiction. Therefore, for the most accurate resource-saving estimates, users must define current testing volumes."]
{"$rows_left_out":43}
{"sheet":"Inputs-Current test volumes","index":3,"n_rows":55,"n_cols":29,"rows_kept":55,"cut":false,"hidden":false,"merged":[[15,7,16,16],[23,7,24,16],[30,7,34,9],[48,4,48,5],[47,4,47,5],[12,4,12,5],[38,4,38,5],[13,4,13,5],[39,4,39,5],[27,4,27,5],[28,4,28,5]]}
[]
[]
[]
[]
[]
[null,null,"Inputs: Current Lab Test Volume"]
[]
[null,null,"1. Define the current volume of lab tests being conducted in your institution."]
[null,null,"The first step required is to estimate the current volume of tests being conducted in your institution (i.e., the status quo). Note that this is to reflect current volumes in a world where there are no reductions or changes to lab test ordering. "]
[null,null,"Default lab test volumes have been provided. Users may adjust the default values by their insitutiton's total bed days occupied per annum. "]
[null,null,"Additionally, to ensure current lab test volume reflects their institution, users can also manually enter the test volumes for 2021 and 2022 based on institutional records and projections. "]
[]
[null,null,null,null,"Default",null,null,"Source/Notes"]
[null,null,null,null,"Number of tests annually"]
[null,null,"Test",null,2021,2022]
{"$rows_left_out":41}
{"sheet":"Inputs-Reductions in testing","index":4,"n_rows":70,"n_cols":9,"rows_kept":70,"cut":false,"hidden":false,"merged":[[53,5,53,6],[54,5,54,6],[62,5,62,6],[63,5,63,6],[44,5,44,6],[45,5,45,6],[8,2,9,18],[35,5,35,6],[17,5,17,6],[20,8,22,13],[36,5,36,6],[26,5,26,6],[27,5,27,6],[18,5,18,6],[24,8,25,13]]}
[]
[]
[]
[]
[]
[null,null,"Inputs: Anticipated Reduction in Lab Test Volume"]
[]
[null,null,"2. Validate the anticipated reductions lab testing volumes at your institution."]
[null,null,"The second step is to define the anticipated volume of lab test in a world where there are policy or institutional changes to lab test ordering. This is the future state that has not yet been implemented in your institution, so it should reflect the anticipated reductions in lab tests associated with policy changes being considered. "]
[]
[null,null,"First, users will select how they would like to define the anticipated changes in lab tests (step 2a). Second, based on the selected approach, users will validate default values provided by CADTH and enter alternative values where appropriate."]
[]
[null,null,"2. a) How would you like to define a change in lab test utilization?"]
[null,null,"Select approach:",null,null,null,null,null,"Users have two options to enter the desired change in lab test utilization. "]
[null,null,null,null,null,null,null,null,"i) CADTH has populated default percent reductions in lab tests based on the literature and clinical expert opinion."]
{"$rows_left_out":56}
{"sheet":"Inputs-Direct costs","index":5,"n_rows":44,"n_cols":10,"rows_kept":44,"cut":false,"hidden":false,"merged":[[35,9,36,16],[24,9,25,20],[9,2,10,10],[13,2,14,10]]}
[]
[]
[]
[]
[]
[null,null,"Inputs: Direct Costs"]
[]
[null,null,"3. Validate direct lab costs."]
[null,null,"The third step of the tool is to define direct costs associated with the test. Default direct costs have been populated. Users may replace these unit costs with their own institutional costs."]
[null,null,"Direct costs are separated by tests that are being decoupled (AST, Urea, CK-MB and PTT) and those ordered as standalone tests based on expert feedback that the direct cost savings associated with reductions in these tests are influenced by whether they are coupled."]
[]
[]
[null,null,"3. a) Coupled tests"]
[null,null,"Feedback from the panel of clinical experts and a review of the literature indicated that, for coupled tests, the main savings associated with de-coupling will come from the reagents required to conduct the test. In addition, since PTT testing can require manual technician support, the cost of that support was also included."]
[]
{"$rows_left_out":30}
{"sheet":"Inputs-Analyzer Time","index":6,"n_rows":32,"n_cols":11,"rows_kept":32,"cut":false,"hidden":false,"merged":[[14,10,14,22],[27,4,27,8],[12,4,12,8],[11,4,11,8],[19,4,19,8],[20,4,20,8],[26,4,26,8],[22,10,22,18],[15,10,15,18]]}
[]
[]
[]
[]
[]
[null,null,"Inputs-Analyzer time"]
[]
[null,null,"4. Validate analyzer time."]
[null,null,"The fourth step of the tool is to validate the analyzer time associated with the five lab tests. "]
[null,null,"Default analyzer times per test have been populated. Users may enter alternative analyzer times with their own institutional data."]
[]
[null,null,null,null,"Default",null,null,null,null,null,"Notes/Source"]
[null,null,null,null,"Test"]
[null,null,"Time per test in minutes",null,"Urea","AST","CK-MB","PTT","Serum Folate"]
[null,null,"Analysis time",null,8,10,{"$f":"F15","v":10},{"$f":"AVERAGE(5.5,15)","v":10.25},43,null,"Clinical expert panel. Estimates were not available for CK-MB, therefore, analyzer time was assumed to be equal to AST.  Default values for urea, PTT and serum folate were derived from a standard in-lab analyzer"]
{"$rows_left_out":18}
{"sheet":"Inputs-Abnormal tests","index":7,"n_rows":47,"n_cols":9,"rows_kept":47,"cut":false,"hidden":false,"merged":[[40,4,40,6],[14,2,14,7],[28,4,28,6],[17,4,17,6],[8,2,10,14],[30,8,34,16]]}
[]
[]
[]
[]
[]
[null,null,"Inputs-Exploratory Analysis Abnormal Tests Costs"]
[]
[null,null,"5. Validate costs of reordering abnormal tests"]
[null,null,"Clinical panel feedback indicated that additional resources are often used investigating abnormal test findings. If a lab is unexpectedly abnormal (i.e., a  test to be decoupled is abnormal but its coupled counterpart is normal), clinicians may re-order the abnormal test and/or additional tests to validate and investigate the abnormal lab.These unexpected instances are being considered as this could present additional cost savings associated with lab test reductions."]
[]
[]
[null,null,"Note that in this example, only the direct costs of re-ordering tests are considered; impacts on analyzer time are not examined. "]
[null,null,"A three step approach follows to estimate the cost of following up on abnormal lab results among the tests that were identified to be reduced."]
[]
[null,null,"5. a) Validate the percentage of time the lab test will be unexpectedly abnormal."]
{"$rows_left_out":33}
{"sheet":"Results","index":8,"n_rows":63,"n_cols":26,"rows_kept":63,"cut":false,"hidden":false,"merged":[[22,23,22,24],[32,23,32,24],[37,21,39,21],[43,23,43,24],[54,23,54,24],[37,3,39,3],[37,12,39,12],[43,14,43,15],[54,14,54,15],[40,4,40,5],[51,4,51,5],[10,2,10,4],[12,5,12,6],[22,14,22,15],[32,14,32,15],[32,5,32,6],[20,2,20,4],[22,5,22,6],[62,4,62,5],[40,13,40,14],[51,13,51,14],[62,13,62,14],[40,22,40,23],[51,22,51,23],[62,22,62,23],[43,5,43,6],[54,5,54,6]]}
[]
[]
[]
[]
[]
[null,null,"Results"]
[]
[null,null,"This worksheet presents the results of the impact of reducing the five lab tests identified as being of low value by CWC. "]
[null,null,"Detailed resource impact results are presented first. Totals for the world with and without reductions to lab test volumes are presented to the right of the resource impact results.  "]
[]
[null,null,"Summary table: Resource Impact  "]
[]
[null,null,null,null,null,"Year "]
[null,null,null,null,"Resource Impact",2021,2022,"2-Year Total"]
[null,null,null,null,"Potential cost savings",{"$f":"F40","v":-153251.40800000002},{"$f":"G40","v":-152838.40299999999},{"$f":"H40","v":-306089.81099999999}]
{"$rows_left_out":49}
{"sheet":"Appendices and References","index":9,"n_rows":12,"n_cols":3,"rows_kept":12,"cut":false,"hidden":false,"merged":[]}
[]
[]
[]
[]
[]
[null,null,"References and Appendices"]
[]
[null,null,"Worksheets to the right of this sheet contain background calculations."]
[]
[null,null,"Reference List"]
[]
[null,null,"Sahadeo, Prajna A., et al. \"The Best of Both Worlds: Eliminating Creatine Kinase-Muscle/Brain (CK-MB) Testing in the Emergency Department Leads to Lower Costs Without Missed Clinical Diagnoses.\" Cureus 13.5 (2021)."]

{"sheet":"Bkg-Ref scenario","index":10,"n_rows":43,"n_cols":9,"rows_kept":43,"cut":false,"hidden":false,"merged":[[35,7,35,8],[26,3,26,4],[34,1,34,4],[35,3,35,4],[1,1,3,3],[8,3,8,4],[7,1,7,4],[16,1,16,4],[25,1,25,4],[17,3,17,4]]}
[]
[null,"Reference Scenario Results"]
[]
[]
[]
[null,"Backend calculations estimating total market size and costs in the reference scenario. "]
[]
[null,"Market Size"]
[null,null,null,"Number of tests annually"]
[null,"Test",null,2021,2022]
[null,"Blood urea nitrogren (BUN)",null,{"$f":"'Inputs-Current test volumes'!E51","v":118039},{"$f":"'Inputs-Current test volumes'!F51","v":114191}]
[null,"Aspartate aminotransferase (AST)",null,{"$f":"'Inputs-Current test volumes'!E52","v":29246},{"$f":"'Inputs-Current test volumes'!F52","v":30970}]
[null,"Creatine kinase (CK-MB)",null,{"$f":"'Inputs-Current test volumes'!E53","v":0},{"$f":"'Inputs-Current test volumes'!F53","v":0}]
[null,"Partial thromboplastin time (PTT)",null,{"$f":"'Inputs-Current test volumes'!E54","v":51577},{"$f":"'Inputs-Current test volumes'!F54","v":51435}]
[null,"Serum Folate",null,{"$f":"'Inputs-Current test volumes'!E55","v":1603},{"$f":"'Inputs-Current test volumes'!F55","v":1635}]
{"$rows_left_out":29}
{"sheet":"Bkg-ND scenario","index":11,"n_rows":43,"n_cols":6,"rows_kept":43,"cut":false,"hidden":false,"merged":[[26,3,26,4],[34,1,34,4],[35,3,35,4],[1,1,3,3],[7,1,7,4],[8,3,8,4],[16,1,16,4],[17,3,17,4],[25,1,25,4]]}
[]
[null,"New Policy Scenario Results"]
[]
[]
[]
[null,"Backend calculations estimating total market size and costs in the reductions in testing scenario. "]
[]
[null,"Market Size"]
[null,null,null,"Number of tests annually"]
[null,"Test",null,2021,2022,"2 year total"]
[null,"Blood urea nitrogren (BUN)",null,{"$f":"(100%-'Inputs-Reductions in testing'!F66)*'Inputs-Current test volumes'!E51","v":5901.9500000000053},{"$f":"(100%-'Inputs-Reductions in testing'!G66)*'Inputs-Current test volumes'!F51","v":5709.5500000000047},{"$f":"SUM(D11:E11)","v":11611.500000000011}]
[null,"Aspartate aminotransferase (AST)",null,{"$f":"(100%-'Inputs-Reductions in testing'!F67)*'Inputs-Current test volumes'!E52","v":2924.5999999999995},{"$f":"(100%-'Inputs-Reductions in testing'!G67)*'Inputs-Current test volumes'!F52","v":3096.9999999999991},{"$f":"SUM(D12:E12)","v":6021.5999999999985}]
[null,"Creatine kinase (CK-MB)",null,{"$f":"(100%-'Inputs-Reductions in testing'!F68)*'Inputs-Current test volumes'!E53","v":0},{"$f":"(100%-'Inputs-Reductions in testing'!G68)*'Inputs-Current test volumes'!F53","v":0},{"$f":"SUM(D13:E13)","v":0}]
[null,"Partial thromboplastin time (PTT)",null,{"$f":"(100%-'Inputs-Reductions in testing'!F69)*'Inputs-Current test volumes'!E54","v":12894.25},{"$f":"(100%-'Inputs-Reductions in testing'!G69)*'Inputs-Current test volumes'!F54","v":12858.75},{"$f":"SUM(D14:E14)","v":25753}]
[null,"Serum Folate",null,{"$f":"(100%-'Inputs-Reductions in testing'!F70)*'Inputs-Current test volumes'!E55","v":80.150000000000077},{"$f":"(100%-'Inputs-Reductions in testing'!G70)*'Inputs-Current test volumes'!F55","v":81.750000000000071},{"$f":"SUM(D15:E15)","v":161.90000000000015}]
{"$rows_left_out":29}
{"sheet":"Bkg-Impact Results","index":12,"n_rows":43,"n_cols":15,"rows_kept":43,"cut":false,"hidden":false,"merged":[[35,9,35,10],[13,7,13,13],[16,7,16,10],[17,9,17,10],[25,7,25,10],[26,9,26,10],[34,7,34,10],[26,3,26,4],[34,1,34,4],[35,3,35,4],[1,1,3,3],[7,1,7,4],[8,3,8,4],[16,1,16,4],[17,3,17,4],[25,1,25,4]]}
[]
[null,"New Policy Scenario Results"]
[]
[]
[]
[null,"Backend calculations estimating total market size and costs in resource impact scenario. "]
[]
[null,"Market Size"]
[null,null,null,"Number of tests annually"]
[null,"Test",null,2021,2022]
[null,"Blood urea nitrogren (BUN)",null,{"$f":"'Bkg-ND scenario'!D11-'Bkg-Ref scenario'!D11","v":-112137.04999999999},{"$f":"'Bkg-ND scenario'!E11-'Bkg-Ref scenario'!E11","v":-108481.45}]
[null,"Aspartate aminotransferase (AST)",null,{"$f":"'Bkg-ND scenario'!D12-'Bkg-Ref scenario'!D12","v":-26321.4},{"$f":"'Bkg-ND scenario'!E12-'Bkg-Ref scenario'!E12","v":-27873}]
[null,"Creatine kinase (CK-MB)",null,{"$f":"'Bkg-ND scenario'!D13-'Bkg-Ref scenario'!D13","v":0},{"$f":"'Bkg-ND scenario'!E13-'Bkg-Ref scenario'!E13","v":0}]
[null,"Partial thromboplastin time (PTT)",null,{"$f":"'Bkg-ND scenario'!D14-'Bkg-Ref scenario'!D14","v":-38682.75},{"$f":"'Bkg-ND scenario'!E14-'Bkg-Ref scenario'!E14","v":-38576.25},null,null,"CHECK"]
[null,"Serum Folate",null,{"$f":"'Bkg-ND scenario'!D15-'Bkg-Ref scenario'!D15","v":-1522.85},{"$f":"'Bkg-ND scenario'!E15-'Bkg-Ref scenario'!E15","v":-1553.25}]
{"$rows_left_out":29}
{"sheet":"Dropdowns","index":13,"n_rows":16,"n_cols":2,"rows_kept":16,"cut":false,"hidden":false,"merged":[]}
[]
["Hospital type","Acute academic"]
[null,"Community/General "]
[null,"Complex continuing care"]
[null,"Small hospitals"]
[]
["Approach to reduction in lab tests","Percent reduction in test use"]
[null,"Volume of lab tests"]
[]
["Volume for 2022","Assume equal to 2021 volumes"]
[null,"Manually enter 2022 volumes"]
[null,"Based on linear extrapolation of historical data (where possible)"]
[]
[]
[null,"Yes"]
{"$rows_left_out":2}
{"sheet":"Central NS test numbers","index":14,"n_rows":9,"n_cols":11,"rows_kept":9,"cut":false,"hidden":false,"merged":[]}
[]
[]
[null,"Year","PT_INR","PTT","AST","ALT","Serum Folate","Urea","Cr","CK-MB","Troponin"]
[null,2018,58022,48572,23355,26506,1253,118200,131312,"           0",19071]
[null,2019,54889,46832,25024,27819,1208,114330,128418,0,18321]
[null,2020,52355,48288,26803,29279,1317,110504,139204,0,16185]
[null,2021,55686,51577,29246,31763,1603,118039,139978,0,19169]
["Projections",2022,{"$f":"TREND(C4:C7,$B$4:$B$7,$B$8:$B$9)","v":52852.5},{"$f":"TREND(D4:D7,$B$4:$B$7,$B$8:$B$9)","v":51435},{"$f":"TREND(E4:E7,$B$4:$B$7,$B$8:$B$9)","v":30970},{"$f":"TREND(F4:F7,$B$4:$B$7,$B$8:$B$9)","v":33149.5},{"$f":"TREND(G4:G7,$B$4:$B$7,$B$8:$B$9)","v":1635},{"$f":"TREND(H4:H7,$B$4:$B$7,$B$8:$B$9)","v":114191},{"$f":"TREND(I4:I7,$B$4:$B$7,$B$8:$B$9)","v":143924},null,{"$f":"TREND(K4:K7,$B$4:$B$7,$B$8:$B$9)","v":17726}]
[null,2023,51898.300000000047,52482.100000000093,32915.200000000186,34872.600000000093,1750.8999999999942,113760.09999999998,147602.40000000037,null,17541.799999999988]

{"sheet":"EORLA Cost data","index":15,"n_rows":75,"n_cols":8,"rows_kept":75,"cut":false,"hidden":false,"merged":[[0,0,3,0],[0,1,3,1],[0,2,3,2],[0,3,3,3],[0,5,0,7]]}
["EORLA _ Reference Lab (TOH) ","Source","Type of Expense","Billable Units \n(2018-19)",null,"2022-23 Pricing"]
[]
[null,null,null,null,null,null,null,"Total"]
[null,null,null,null,null,"Fixed","Variable"]
[]
["PG10400 - SGOT (AST)",null,null,147862,null,1.02,0.57000000000000006,1.59]
[null,"Direct",null,null,null,0.8,0.57000000000000006,1.37]
[null,null,"COMPENSATION - MOS",null,null,0.09,0,0.09]
[null,null,"COMPENSATION - MP",null,null,0.15,0,0.15]
[null,null,"COMPENSATION - UPP",null,null,0.45,0,0.46]
[null,null,"CONTRACTED OUT SERVICES",null,null,0,0,0]
[null,null,"SUPPLIES",null,null,0,0.04,0.04]
[null,null,"SUNDRY EXPENSE",null,null,0.01,0,0.01]
[null,null,"EQUIPMENT EXPENSE",null,null,7.0000000000000007E-2,0,7.0000000000000007E-2]
[null,null,"BUILDINGS / GROUNDS EXPENSE",null,null,0,0,0]
{"$rows_left_out":61}
{"sheet":"Test time","index":16,"n_rows":9,"n_cols":6,"rows_kept":9,"cut":false,"hidden":false,"merged":[]}
[]
[]
[]
[null,"Test","Analyzer analysis time per test","Reporting time when  within auto-validation limits","Reporting time when outside auto-validation limits*","Reporting time when outside auto-validation limits* MEDIAN"]
[null,"Urea","8 minutes","~2-3 mins","~4- 10 mins",{"$f":"MEDIAN(4,10)","v":7}]
[null,"Folate","43 minutes","~2-3 mins","~4 mins",4]
[null,"AST","10 minutes","~2-3 mins","~4-10 mins",{"$f":"MEDIAN(4,10)","v":7}]
[null,"PTT","5.5- 15 minutes**"]
[null,"CK-MB","Not done in NS"]

{"sheet":"Data Store","index":17,"n_rows":27,"n_cols":18,"rows_kept":27,"cut":false,"hidden":true,"merged":[[0,2,0,6],[18,2,18,8]]}
[null,null,"Cost per test"]
[null,null,"BUN","Folate","PTT","AST","CK-MB",null,"Median Lab Assistant hourly wage"]
[null,"Province"]
[null,"Newfoundland and Labrador","BUN cost","Folate cost","PPT $","AST$","CK-MB $",null,29]
[null,"Prince Edward Island","BUN cost","Folate cost","PPT $","AST$","CK-MB $",null,25]
[null,"Nova Scotia","BUN cost","Folate cost","PPT $","AST$","CK-MB $",null,23.9,null,null,null,null,"User Input","Default ","Current Value",null,"Notes/Source"]
[null,"New Brunswick","BUN cost","Folate cost","PPT $","AST$","CK-MB $",null,21.46,null,"Hourly cost of MLA time",null,null,null,{"$f":"INDEX('Data Store'!$I$2:$I$16,MATCH('Data Store'!$E$27,'Data Store'!$B$2:$B$16,0),)","v":29},{"$f":"IF(N7=\"\",O7,N7)","v":29},null,"https://www.jobbank.gc.ca/marketreport/wages-occupation/4214/ca"]
[null,"Quebec","BUN cost","Folate cost","PPT $","AST$","CK-MB $",null,29]
[null,"Ontario",1.28,3.11,2.66,1.28,"CK-MB $",null,29]
[null,"Manitoba","BUN cost","Folate cost","PPT $","AST$","CK-MB $",null,24.3]
[null,"Saskatchewan","BUN cost","Folate cost",10.199999999999999,"AST$","CK-MB $",null,23.41]
[null,"Alberta",11.91,"Folate cost",16.88,"AST$","CK-MB $",null,28.34]
[null,"British Columbia","BUN cost","Folate cost","PPT $","AST$","CK-MB $",null,25]
[null,"Yukon","BUN cost","Folate cost","PPT $","AST$","CK-MB $",null,{"$f":"AVERAGE($I$4:$I$13)","v":25.841000000000001},"NA-Average of other jurisdictions"]
[null,"Northwest Territories","BUN cost","Folate cost","PPT $","AST$","CK-MB $",null,{"$f":"AVERAGE($I$4:$I$13)","v":25.841000000000001},"NA-Average of other jurisdictions"]
{"$rows_left_out":13}
{"sheet":"Query Indirect costs","index":18,"n_rows":13,"n_cols":10,"rows_kept":13,"cut":false,"hidden":true,"merged":[[6,2,6,8],[9,9,10,15]]}
[]
[]
[]
[]
[null,null,"Inputs-Indirect costs"]
[]
[null,null,"Hospital indirect cost per test"]
[null,null,"Test",null,null,"User Input","Default ","Current Value"]
[null,null,"Urea",null,null,null,0.22,{"$f":"IF(F9=\"\",G9,F9)","v":0.22},null,"Source: EORLA reference labs; 2022-23 pricing "]
[null,null,"Folate",null,null,null,0.35,{"$f":"IF(F10=\"\",G10,F10)","v":0.35},null,"Indirect costs include: corporate loading/deprecipation; site administration; employee future benefits and EORLA LIS"]
[null,null,"Partial thromboplastin time (PTT)",null,null,null,0.57999999999999996,{"$f":"IF(F11=\"\",G11,F11)","v":0.57999999999999996}]
[null,null,"Aspartate aminotransferase (AST)",null,null,null,0.22,{"$f":"IF(F12=\"\",G12,F12)","v":0.22}]
[null,null,"Creatine kinase (CK-MB)",null,null,null,{"$f":"G10","v":0.35},{"$f":"IF(F13=\"\",G13,F13)","v":0.35},null,"CK-MB cost assumed to be equal to folate."]